Previous Thread
Next Thread
Print Thread
Page 1 of 2 1 2
0.192 build failing on OS 10.13 #111544
12/08/17 03:33 AM
12/08/17 03:33 AM
Joined: Jul 2007
Posts: 211
California
M
Monotremata Offline OP
Senior Member
Monotremata  Offline OP
Senior Member
M
Joined: Jul 2007
Posts: 211
California
Wow haven't had a single snag ever since I ditched my 2006 Mac Pro last year and just did trying to build MAME 0.192. Keeps stopping with this error here:

Code
Creating ../../../../osx_clang/bin/x64/Release
Precompiling src/emu/emu.h...
dyld: Symbol not found: __ZNKSt3_V214error_category10_M_messageB5cxx11Ei
  Referenced from: /usr/local/bin/clang++
  Expected in: /usr/lib/libstdc++.6.0.9.dylib
 in /usr/local/bin/clang++
make[2]: *** [../../../../osx_clang/obj/x64/Release/emu.h.gch] Abort trap: 6
make[1]: *** [precompile] Error 2
make: *** [macosx_x64_clang] Error 2


Any ideas? 0.191 and everything before it went smooth as ever. I did just recently install the last two Xcode updates that came out in the last week or so if that matters.

Re: 0.192 build failing on OS 10.13 [Re: Monotremata] #111554
12/08/17 12:45 PM
12/08/17 12:45 PM
Joined: Mar 2001
Posts: 16,005
USA
R
R. Belmont Offline
Very Senior Member
R. Belmont  Offline
Very Senior Member
R
Joined: Mar 2001
Posts: 16,005
USA
That's weird. Did you try doing a make clean after installing the Xcode update? It's usually a good idea.

Re: 0.192 build failing on OS 10.13 [Re: Monotremata] #111555
12/08/17 12:49 PM
12/08/17 12:49 PM
Joined: May 2008
Posts: 4,892
Germany
Q
qmc2 Offline
Very Senior Member
qmc2  Offline
Very Senior Member
Q
Joined: May 2008
Posts: 4,892
Germany
I had a chance to build "latest" MAME on macOS High Sierra recently (a git revision from last week) and it worked fine for me. It was a clean build and I installed the latest XCode update before I tried.


A mind is like a parachute. It doesn't work unless it's open. [Frank Zappa]

We're searching for QMC2 translators and support for existing translations. Interested? See here!
Re: 0.192 build failing on OS 10.13 [Re: R. Belmont] #111564
12/08/17 08:45 PM
12/08/17 08:45 PM
Joined: Jul 2007
Posts: 211
California
M
Monotremata Offline OP
Senior Member
Monotremata  Offline OP
Senior Member
M
Joined: Jul 2007
Posts: 211
California
Originally Posted by R. Belmont
That's weird. Did you try doing a make clean after installing the Xcode update? It's usually a good idea.


What directory would I run that in though? This was a fresh download of 0.192, I even downloaded it twice just in case the first download somehow got corrupted. Just tried again and still the same error. I looked it up last night and apparently this trap error is related to something writing to a memory space thats already in use or something like that? Which makes no sense to me considering what Im doing. Tried closing everything that was running, rebooting to flush out RAM, everything I could think of. Just built a snapshot of Exult just to see if something was going on but that built perfectly fine. Im stumped.

Re: 0.192 build failing on OS 10.13 [Re: Monotremata] #111568
12/09/17 10:21 AM
12/09/17 10:21 AM
Joined: May 1999
Posts: 531
Luxembourg
Carbon Offline
Senior Member
Carbon  Offline
Senior Member
Joined: May 1999
Posts: 531
Luxembourg
I had no trouble building 0.192 on my iMac 5k, either. But I always start with a fresh download when a new release happens.

Re: 0.192 build failing on OS 10.13 [Re: Carbon] #111580
12/09/17 11:00 PM
12/09/17 11:00 PM
Joined: Jul 2007
Posts: 211
California
M
Monotremata Offline OP
Senior Member
Monotremata  Offline OP
Senior Member
M
Joined: Jul 2007
Posts: 211
California
Originally Posted by Carbon
I had no trouble building 0.192 on my iMac 5k, either. But I always start with a fresh download when a new release happens.


Yeah same here. I even downloaded it twice just to make sure and it still wont work.

Re: 0.192 build failing on OS 10.13 [Re: Monotremata] #111582
12/10/17 02:14 PM
12/10/17 02:14 PM
Joined: Sep 2000
Posts: 197
DC, USA
W
will Offline
Senior Member
will  Offline
Senior Member
W
Joined: Sep 2000
Posts: 197
DC, USA
No trouble compiling 0.192 on my iMac 5K. I'm running 10.13.2 and have Xcode 9.2 installed. Have you tried a simple make command or are you adding a bunch of arguments to make?


=will=
Re: 0.192 build failing on OS 10.13 [Re: Monotremata] #111610
12/11/17 07:56 PM
12/11/17 07:56 PM
Joined: Jul 2007
Posts: 211
California
M
Monotremata Offline OP
Senior Member
Monotremata  Offline OP
Senior Member
M
Joined: Jul 2007
Posts: 211
California
make -j5 TOOLS=1 REGENIE=1 is it. Just make by itself doesn't work either.

Re: 0.192 build failing on OS 10.13 [Re: Monotremata] #111611
12/11/17 08:38 PM
12/11/17 08:38 PM
Joined: May 1999
Posts: 531
Luxembourg
Carbon Offline
Senior Member
Carbon  Offline
Senior Member
Joined: May 1999
Posts: 531
Luxembourg
Is the REGENIE really necessary if you start from scratch?

Re: 0.192 build failing on OS 10.13 [Re: Monotremata] #111612
12/11/17 08:43 PM
12/11/17 08:43 PM
Joined: Mar 2001
Posts: 16,005
USA
R
R. Belmont Offline
Very Senior Member
R. Belmont  Offline
Very Senior Member
R
Joined: Mar 2001
Posts: 16,005
USA
Yes.

Page 1 of 2 1 2

Moderated by  R. Belmont 

Who's Online Now
2 registered members (JonasP, Darkstar), 52 guests, and 1 spider.
Key: Admin, Global Mod, Mod
Shout Box
Forum Statistics
Forums9
Topics8,575
Posts112,029
Members4,812
Most Online225
May 26th, 2014
Powered by UBB.threads™ PHP Forum Software 7.6.1.1
(Release build 20180111)
Page Time: 0.026s Queries: 14 (0.009s) Memory: 5.7193 MB (Peak: 5.9387 MB) Zlib enabled. Server Time: 2018-09-20 08:32:57 UTC