Previous Thread
Next Thread
Print Thread
MAME 0.202 Mac 10.14 compile fails #114001
09/27/18 11:22 PM
09/27/18 11:22 PM
Joined: Sep 2000
Posts: 202
DC, USA
W
will Offline OP
Senior Member
will  Offline OP
Senior Member
W
Joined: Sep 2000
Posts: 202
DC, USA
Upgraded to macOS 10.14 Mojave

MAME 0.202 compile fails pretty quickly:

ld: library not found for -lgcc_s.10.4
clang: error: linker command failed with exit code 1 (use -v to see invocation)
make[1]: *** [../../bin/darwin/genie] Error 1
make: *** [3rdparty/genie/bin/darwin/genie] Error 2

Any help here? Thanks.


=will=
Re: MAME 0.202 Mac 10.14 compile fails [Re: will] #114003
09/28/18 12:05 AM
09/28/18 12:05 AM
Joined: Aug 2004
Posts: 1,366
Robbbert Offline
Very Senior Member
Robbbert  Offline
Very Senior Member
Joined: Aug 2004
Posts: 1,366
See this thread

https://forums.bannister.org/ubbthreads.php?ubb=showflat&Number=113972

which is in the wrong forum area.


Moderated by  R. Belmont 

Who's Online Now
3 registered members (robcfg, ted, Cpt. Pugwash), 123 guests, and 2 spiders.
Key: Admin, Global Mod, Mod
Shout Box
Forum Statistics
Forums9
Topics8,606
Posts112,517
Members4,828
Most Online296
Dec 5th, 2018
Powered by UBB.threads™ PHP Forum Software 7.6.1.1
(Release build 20180111)
Page Time: 0.022s Queries: 14 (0.008s) Memory: 5.5844 MB (Peak: 5.7417 MB) Zlib enabled. Server Time: 2018-12-16 14:46:47 UTC