Hello Rene, now with the last SVN r7223 have problem with compiling:

Code:
s\win32-g++-4.6" -o release\movierecordersetup.o movierecordersetup.cpp
compilation terminated.
Makefile.qmake.Release:3508: recipe for target 'release/collectionrebuilder.o' failed
make.exe[2]: *** [release/collectionrebuilder.o] Error 1
make.exe[2]: *** Waiting for unfinished jobs....
make.exe[2]: Leaving directory 'g:/compile_mame/qmc2'
Makefile.qmake:34: recipe for target 'release' failed
make.exe[1]: *** [release] Error 2
make.exe[1]: Leaving directory 'g:/compile_mame/qmc2'
makefile:1049: recipe for target 'qmc2-bin' failed
make.exe: *** [qmc2-bin] Error 2
make.exe: Leaving directory 'g:/compile_mame/qmc2'
Finish at:  8:52:43,35


tnx smile