Hi. I am trying to compile and it gives me the following error:

Code
romalyzer.cpp:3638:172: error: too many arguments to function ‘int zipOpenNewFileInZip(zipFile, const char*, const zip_fileinfo*, const void*, uInt, const void*, uInt, const char*, int, int)’
 pInfo, file.toUtf8().constData(), file.length(), 0, 0, 0, Z_DEFLATED, spinBoxSetRewriterZipLevel->value(), 0) == ZIP_OK ) {
                                                                                                             ^
In file included from romalyzer.cpp:31:0:
minizip/zip.h:119:20: note: declared here
 extern int ZEXPORT zipOpenNewFileInZip OF((zipFile file, const char* filename, const zip_fileinfo* zipfi,
                    ^~~~~~~~~~~~~~~~~~~
Makefile.qmake:2425: recipe for target 'romalyzer.o' failed
make[1]: *** [romalyzer.o] Error 1
make[1]: Leaving directory '/home/lex/.src/qmc2'
Makefile:1042: recipe for target 'qmc2-bin' failed
make: *** [qmc2-bin] Error 2


[ ...pensando en imágenes ]