Wow... Sorry... I really need a nap...

Let's try that again...

Code
Compiling src/devices/cpu/spc700/spc700ds.cpp...
Compiling src/mame/machine/nl_pongdoubles.cpp...
Compiling src/devices/cpu/ssem/ssemdasm.cpp...
Compiling src/mame/machine/dec0.cpp...
Compiling src/mame/drivers/cmi.cpp...
Compiling src/devices/cpu/ssp1601/ssp1601d.cpp...
../../../../../src/mame/drivers/cmi.cpp:164:43: error: result of '10 ^ 7' is 13;
      did you mean '1e7'? [-Werror,-Wxor-used-as-pow]
        12 ^ 7, 8 ^ 7, 13 ^ 7, 9 ^ 7, 14 ^ 7, 10 ^ 7, 15 ^ 7, 11  ^ 7
                                              ~~~^~~
                                              1e7
../../../../../src/mame/drivers/cmi.cpp:164:43: note: replace expression with
      '0xA ^ 7' or use 'xor' instead of '^' to silence this warning
Compiling src/mame/machine/deco102.cpp...
Compiling src/devices/cpu/st62xx/st62xx_dasm.cpp...
Compiling src/mame/drivers/starfire.cpp...
1 error generated.
make[2]: *** [../../../../osx_clang/obj/x64/Release/src/mame/drivers/cmi.o] Error 1
make[1]: *** [fairlight] Error 2
make[1]: *** Waiting for unfinished jobs....
Compiling src/mame/machine/nl_pongf.cpp...
Compiling src/mame/machine/deco104.cpp...
Compiling src/devices/cpu/superfx/sfx_dasm.cpp...


The following statement is true...
The preceding statement is false.