seems there is a problem with the latest svn. Trying to compile gives the following:
Code:
make TARGET=mess
Compiling src/emu/cpu/rsp/rspfe.c...
src/emu/cpu/rsp/rspfe.c: In function 'int rspfe_describe(void*, opcode_desc*, const opcode_desc*)':
src/emu/cpu/rsp/rspfe.c:65: error: 'LIMMVAL' was not declared in this scope
src/emu/cpu/rsp/rspfe.c:85: error: 'SIMMVAL' was not declared in this scope
src/emu/cpu/rsp/rspfe.c: In function 'int describe_instruction_regimm(rsp_state*, UINT32, opcode_desc*)':
src/emu/cpu/rsp/rspfe.c:238: error: 'SIMMVAL' was not declared in this scope
make: *** [obj/windows/mess/emu/cpu/rsp/rspfe.o] Error 1


Last edited by Kaylee; 01/04/11 04:39 PM.