Get the following while compiling the newest svn
Code:
src/mess/drivers/atarist.c: In member function 'void st_state::configure_memory(
)':
src/mess/drivers/atarist.c:2064: error: unused variable 'ram'
src/mess/drivers/atarist.c: In member function 'virtual void stbook_state::machi
ne_start()':
src/mess/drivers/atarist.c:2203: error: unused variable 'ram'
make: *** [obj/windows/mess/mess/drivers/atarist.o] Error 1



Edit: Compiles past this if I comment the 2 lines out

Last edited by Kaylee; 01/09/11 04:07 PM.