Me get this while compiling:
Code:
Compiling src/mess/drivers/craft.c...
src/mess/drivers/craft.c: In function 'void avr8_update_timer1_clock_source(runn
ing_machine*)':
src/mess/drivers/craft.c:646: error: 'AVR8_TIMER2_CLOCK_SELECT' was not declared
 in this scope
src/mess/drivers/craft.c: In function 'void avr8_update_timer2_waveform_gen_mode
(running_machine*)':
src/mess/drivers/craft.c:711: error: 'AVR8_WGM2' was not declared in this scope
src/mess/drivers/craft.c:713: error: 'WGM2_NORMAL' is not a member of 'Avr8'
src/mess/drivers/craft.c:714: error: 'WGM2_PWM_PC' is not a member of 'Avr8'
src/mess/drivers/craft.c:715: error: 'WGM2_FAST_PWM' is not a member of 'Avr8'
src/mess/drivers/craft.c:719: error: 'WGM2_CTC_CMP' is not a member of 'Avr8'
src/mess/drivers/craft.c:720: error: 'WGM2_PWM_PC_CMP' is not a member of 'Avr8'

src/mess/drivers/craft.c:721: error: 'WGM2_FAST_PWM_CMP' is not a member of 'Avr8'
src/mess/drivers/craft.c:722: error: 'AVR8_OCR2A' was not declared in this scope

src/mess/drivers/craft.c: In function 'void avr8_changed_tccr2a(running_machine*, UINT8)':
src/mess/drivers/craft.c:735: error: 'AVR8_TCCR2A' was not declared in this scope
src/mess/drivers/craft.c:739: error: 'AVR8_TCCR2A_WGM2_10_MASK' was not declared
 in this scope
cc1plus.exe: warnings being treated as errors
src/mess/drivers/craft.c:733: error: unused variable 'state'
src/mess/drivers/craft.c: In function 'void avr8_update_timer2_clock_source(runn
ing_machine*)':
src/mess/drivers/craft.c:750: error: 'AVR8_TIMER2_CLOCK_SELECT' was not declared
 in this scope
src/mess/drivers/craft.c: In function 'void avr8_changed_tccr2b(running_machine*, UINT8)':
src/mess/drivers/craft.c:790: error: 'AVR8_TCCR2B' was not declared in this scope
src/mess/drivers/craft.c:794: error: 'AVR8_TCCR2B_FOC2A_MASK' was not declared in this scope
src/mess/drivers/craft.c:800: error: 'AVR8_TCCR2B_FOC2B_MASK' was not declared in this scope
src/mess/drivers/craft.c:806: error: 'AVR8_TCCR2B_WGM2_2_MASK' was not declared
in this scope
src/mess/drivers/craft.c:812: error: 'AVR8_TCCR2B_CS_MASK' was not declared in this scope
src/mess/drivers/craft.c:788: error: unused variable 'state'
make: *** [obj/winui/mess/mess/drivers/craft.o] Error 1

Last edited by Kaylee; 01/19/11 04:53 AM.